Reaction Details
TargetPotassium voltage-gated channel subfamily H member 2
LigandBDBM50255040
Substrate/Competitorn/a
Meas. Tech.ChEMBL_560248 (CHEMBL1019587)
IC50 15700±n/a nM
Citation Dhar, TGYang, GDavies, PMalley, MFGougoutas, JZWu, DRBarrish, JCCarter, PH Urea based CCR3 antagonists employing a tetrahydro-1,3-oxazin-2-one spacer. Bioorg Med Chem Lett19:96-9 (2008) 
 
Potassium voltage-gated channel subfamily H member 2
Name:Potassium voltage-gated channel subfamily H member 2
Type:Multi-pass membrane protein
Mol. Mass.:126672.65
Organism:Homo sapiens (Human)
Description:Q12809
Residue:1159
BDBM50255040
NameBDBM50255040
Synonyms:1-(6-(((S)-3-(4-fluorobenzyl) piperidin-1-yl)methyl)-3,5-dimethyl-2-oxo-1,3-oxazinan-5-yl)-3-(3-(1-methyl-1H-tetrazol-5-yl)phenyl)urea CHEMBL518571
TypeSmall organic molecule
Emp. Form.C28H35FN8O3
Mol. Mass.550.6277
SMILESCN1CC(C)(NC(=O)Nc2cccc(c2)-c2nnnn2C)C(CN2CCC[C@@H](Cc3ccc(F)cc3)C2)OC1=O