Reaction Details
TargetCalmodulin-1
LigandBDBM50001888
Substrate/Competitorn/a
Meas. Tech.ChEMBL_543916 (CHEMBL1020351)
IC50 7260±n/a nM
Citation Figueroa, MGonzález, Mdel CRodríguez-Sotres, RSosa-Peinado, AGonzález-Andrade, MCerda-García-Rojas, CMMata, R Calmodulin inhibitors from the fungus Emericella sp. Bioorg Med Chem17:2167-74 (2009) 
 
Calmodulin-1
Name:Calmodulin-1
Type:Protein
Mol. Mass.:16813.73
Organism:Human
Description:P0DP23
Residue:149
BDBM50001888
NameBDBM50001888
Synonyms:(chloropromazine) [3-(2-Chloro-phenothiazin-10-yl)-propyl]-dimethyl-amine 1-(2-Allyl-phenoxy)-3-isopropylamino-propan-2-ol 3-(2-chloro-10H-phenothiazin-10-yl)-N,N-dimethylpropan-1-amine CHLORPROMAZINE CHLORPROMAZINE HYDROCHLORIDE CHLORPROMAZINE TANNATE PROMAPAR THORAZINE [3-(2-Chloro-phenothiazin-10-yl)-propyl]-dimethyl-amine( Chlorpromazine) chloropromazine | med.21724, Compound 15
TypeSmall organic molecule
Emp. Form.C17H19ClN2S
Mol. Mass.318.864
SMILESCN(C)CCCN1c2ccccc2Sc2ccc(Cl)cc12