Reaction Details
TargetCalmodulin-1
LigandBDBM50266274
Substrate/Competitorn/a
Meas. Tech.ChEMBL_543917 (CHEMBL1020352)
Ki 25380±n/a nM
Citation Figueroa, MGonzález, Mdel CRodríguez-Sotres, RSosa-Peinado, AGonzález-Andrade, MCerda-García-Rojas, CMMata, R Calmodulin inhibitors from the fungus Emericella sp. Bioorg Med Chem17:2167-74 (2009) 
 
Calmodulin-1
Name:Calmodulin-1
Type:Protein
Mol. Mass.:16813.73
Organism:Human
Description:P0DP23
Residue:149
BDBM50266274
NameBDBM50266274
Synonyms:14-methoxytajixanthone | CHEMBL515370
TypeSmall organic molecule
Emp. Form.C26H28O7
Mol. Mass.452.4963
SMILESCO[C@H]([C@@H]1OC1(C)C)c1ccc(O)c2c1oc1cc(C)c3OC[C@@H]([C@@H](O)c3c1c2=O)C(C)=C