Reaction Details
TargetB1 bradykinin receptor
LigandBDBM50254461
Substrate/Competitorn/a
Meas. Tech.ChEMBL_560709 (CHEMBL1010844)
Ki 463±n/a nM
Citation Cole, AGMetzger, ABrescia, MRQin, LYAppell, KCBrain, CTHallett, AGanju, PDenholm, AAWareing, JRRitchie, TJDrake, GMBevan, SJMacGloinn, AMcBryde, APatel, VOakley, PJNunez, XGstach, HSchneider, PBaldwin, JJDolle, REMcDonald, EHenderson, I Sulfonamido-aryl ethers as bradykinin B1 receptor antagonists. Bioorg Med Chem Lett19:119-22 (2008) 
 
B1 bradykinin receptor
Name:B1 bradykinin receptor
Type:Enzyme
Mol. Mass.:40508.87
Organism:Homo sapiens (Human)
Description:P46663
Residue:353
BDBM50254461
NameBDBM50254461
Synonyms:CHEMBL507546 | N-(2-chlorobenzyl)-2-(N-(4-isobutoxy-3-methoxybenzyl)-4-(morpholinomethyl)phenylsulfonamido)acetamide
TypeSmall organic molecule
Emp. Form.C32H40ClN3O6S
Mol. Mass.630.195
SMILESCOc1cc(CN(CC(=O)NCc2ccccc2Cl)S(=O)(=O)c2ccc(CN3CCOCC3)cc2)ccc1OCC(C)C