Reaction Details
TargetC-C chemokine receptor type 5
LigandBDBM50254718
Substrate/Competitorn/a
Meas. Tech.ChEMBL_560710 (CHEMBL1010845)
IC50 22±n/a nM
Citation Yang, HLin, XFPadilla, FGabriel, SDHeilek, GJi, CSankuratri, SdeRosier, ABerry, PRotstein, DM Discovery of a potent, selective and orally bioavailable 3,9-diazaspiro[5.5]undeca-2-one CCR5 antagonist. Bioorg Med Chem Lett19:209-13 (2008) 
 
C-C chemokine receptor type 5
Name:C-C chemokine receptor type 5
Type:Enzyme
Mol. Mass.:40540.21
Organism:Homo sapiens (Human)
Description:P51681
Residue:352
BDBM50254718
NameBDBM50254718
Synonyms:(4-(7-butyl-9-(tetrahydro-2H-pyran-4-ylsulfonyl)-3,9-diazaspiro[5.5]undecan-3-yl)-4-methylpiperidin-1-yl)(4,6-dimethylpyrimidin-5-yl)methanone | CHEMBL454253
TypeSmall organic molecule
Emp. Form.C31H51N5O4S
Mol. Mass.589.833
SMILESCCCCC1CN(CCC11CCN(CC1)C1(C)CCN(CC1)C(=O)c1c(C)ncnc1C)S(=O)(=O)C1CCOCC1