Reaction Details
TargetC-X-C chemokine receptor type 3
LigandBDBM50412597
Substrate/Competitorn/a
Meas. Tech.ChEMBL_560732 (CHEMBL1010867)
IC50 200±n/a nM
Citation Wang, YBusch-Petersen, JWang, FKiesow, TJGraybill, TLJin, JYang, ZFoley, JJHunsberger, GESchmidt, DBSarau, HMCapper-Spudich, EAWu, ZFisher, LSMcQueney, MSRivero, RAWiddowson, KL Camphor sulfonamide derivatives as novel, potent and selective CXCR3 antagonists. Bioorg Med Chem Lett19:114-8 (2008) 
 
C-X-C chemokine receptor type 3
Name:C-X-C chemokine receptor type 3
Type:Enzyme Catalytic Domain
Mol. Mass.:40665.65
Organism:Homo sapiens (Human)
Description:n/a
Residue:368
BDBM50412597
NameBDBM50412597
Synonyms:CHEMBL459951
TypeSmall organic molecule
Emp. Form.C21H30F3N3O3S
Mol. Mass.461.541
SMILESCC1(O)C[C@H]2CC[C@]1(CS(=O)(=O)N1CCN(CC1)c1ccc(cn1)C(F)(F)F)C2(C)C