Reaction Details
TargetC-X-C chemokine receptor type 3
LigandBDBM50412559
Substrate/Competitorn/a
Meas. Tech.ChEMBL_560732 (CHEMBL1010867)
IC50 125.89±n/a nM
Citation Wang, YBusch-Petersen, JWang, FKiesow, TJGraybill, TLJin, JYang, ZFoley, JJHunsberger, GESchmidt, DBSarau, HMCapper-Spudich, EAWu, ZFisher, LSMcQueney, MSRivero, RAWiddowson, KL Camphor sulfonamide derivatives as novel, potent and selective CXCR3 antagonists. Bioorg Med Chem Lett19:114-8 (2008) 
 
C-X-C chemokine receptor type 3
Name:C-X-C chemokine receptor type 3
Type:Enzyme Catalytic Domain
Mol. Mass.:40665.65
Organism:Homo sapiens (Human)
Description:n/a
Residue:368
BDBM50412559
NameBDBM50412559
Synonyms:CHEMBL464083
TypeSmall organic molecule
Emp. Form.C20H27F3N4O3S
Mol. Mass.460.514
SMILESC[C@H]1CN(CCN1c1ncc(cn1)C(F)(F)F)S(=O)(=O)C[C@]12CC[C@H](CC1=O)C2(C)C