Reaction Details
TargetTyrosine-protein kinase Lck
LigandBDBM50255049
Substrate/Competitorn/a
Meas. Tech.ChEMBL_558462 (CHEMBL963868)
IC50 7000±n/a nM
Citation Tecle, HShao, JLi, YKothe, MKazmirski, SPenzotti, JDing, YHOhren, JMoshinsky, DColi, RJhawar, NBora, EJacques-O'Hagan, SWu, J Beyond the MEK-pocket: can current MEK kinase inhibitors be utilized to synthesize novel type III NCKIs? Does the MEK-pocket exist in kinases other than MEK? Bioorg Med Chem Lett19:226-9 (2008) 
 
Tyrosine-protein kinase Lck
Name:Tyrosine-protein kinase Lck
Type:n/a
Mol. Mass.:57987.83
Organism:Homo sapiens (Human)
Description:P06239
Residue:509
BDBM50255049
NameBDBM50255049
Synonyms:5-{[2-(4-Chloro-benzenesulfonyl)-acetyl]-hydrazonomethyl}-3,4-difluoro-2-(2-fluoro-4-iodo-phenylamino)-benzoic acid | CHEMBL481969
TypeSmall organic molecule
Emp. Form.C22H14ClF3IN3O5S
Mol. Mass.651.781
SMILESOC(=O)c1cc(C=NNC(=O)CS(=O)(=O)c2ccc(Cl)cc2)c(F)c(F)c1Nc1ccc(I)cc1F