Reaction Details
TargetEphrin type-A receptor 2
LigandBDBM50255013
Substrate/Competitorn/a
Meas. Tech.ChEMBL_558464 (CHEMBL963870)
IC50>30000±n/a nM
Citation Tecle, HShao, JLi, YKothe, MKazmirski, SPenzotti, JDing, YHOhren, JMoshinsky, DColi, RJhawar, NBora, EJacques-O'Hagan, SWu, J Beyond the MEK-pocket: can current MEK kinase inhibitors be utilized to synthesize novel type III NCKIs? Does the MEK-pocket exist in kinases other than MEK? Bioorg Med Chem Lett19:226-9 (2008) 
 
Ephrin type-A receptor 2
Name:Ephrin type-A receptor 2
Type:PROTEIN
Mol. Mass.:108260.70
Organism:Homo sapiens (Human)
Description:ChEMBL_1505248
Residue:976
BDBM50255013
NameBDBM50255013
Synonyms:(S)-5-((2,4-diamino-4-oxobutanamido)methyl)-3,4-difluoro-2-(2-fluoro-4-iodophenylamino)benzoic acid | CHEMBL517647
TypeSmall organic molecule
Emp. Form.C18H16F3IN4O4
Mol. Mass.536.2437
SMILESN[C@@H](CC(N)=O)C(=O)NCc1cc(C(O)=O)c(Nc2ccc(I)cc2F)c(F)c1F