Reaction Details
TargetAurora kinase A
LigandBDBM50255048
Substrate/Competitorn/a
Meas. Tech.ChEMBL_558465 (CHEMBL963871)
IC50 3000±n/a nM
Citation Tecle, HShao, JLi, YKothe, MKazmirski, SPenzotti, JDing, YHOhren, JMoshinsky, DColi, RJhawar, NBora, EJacques-O'Hagan, SWu, J Beyond the MEK-pocket: can current MEK kinase inhibitors be utilized to synthesize novel type III NCKIs? Does the MEK-pocket exist in kinases other than MEK? Bioorg Med Chem Lett19:226-9 (2008) 
 
Aurora kinase A
Name:Aurora kinase A
Type:Serine/threonine-protein kinase
Mol. Mass.:45830.98
Organism:Homo sapiens (Human)
Description:O14965
Residue:403
BDBM50255048
NameBDBM50255048
Synonyms:3,4-Difluoro-2-(2-fluoro-4-iodo-phenylamino)-5-[(5-hydroxymethyl-furan-2-carbonyl)-hydrazonomethyl]-benzoic acid | CHEMBL481968
TypeSmall organic molecule
Emp. Form.C20H13F3IN3O5
Mol. Mass.559.234
SMILESOCc1ccc(o1)C(=O)NN=Cc1cc(C(O)=O)c(Nc2ccc(I)cc2F)c(F)c1F