Reaction Details
TargetDual specificity protein kinase CLK1
LigandBDBM50255012
Substrate/Competitorn/a
Meas. Tech.ChEMBL_558469 (CHEMBL963875)
IC50>30000±n/a nM
Citation Tecle, HShao, JLi, YKothe, MKazmirski, SPenzotti, JDing, YHOhren, JMoshinsky, DColi, RJhawar, NBora, EJacques-O'Hagan, SWu, J Beyond the MEK-pocket: can current MEK kinase inhibitors be utilized to synthesize novel type III NCKIs? Does the MEK-pocket exist in kinases other than MEK? Bioorg Med Chem Lett19:226-9 (2008) 
 
Dual specificity protein kinase CLK1
Name:Dual specificity protein kinase CLK1
Type:Protein
Mol. Mass.:57322.21
Organism:Homo sapiens (Human)
Description:P49759
Residue:484
BDBM50255012
NameBDBM50255012
Synonyms:5-((4-(methylsulfonyl)benzylamino)methyl)-3,4-difluoro-2-(2-fluoro-4-iodophenylamino)benzoic acid | CHEMBL465465
TypeSmall organic molecule
Emp. Form.C22H18F3IN2O4S
Mol. Mass.590.354
SMILESCS(=O)(=O)c1ccc(CNCc2cc(C(O)=O)c(Nc3ccc(I)cc3F)c(F)c2F)cc1