Reaction Details
TargetProtein kinase C beta type
LigandBDBM50255049
Substrate/Competitorn/a
Meas. Tech.ChEMBL_558471 (CHEMBL963877)
IC50>30000±n/a nM
Citation Tecle, HShao, JLi, YKothe, MKazmirski, SPenzotti, JDing, YHOhren, JMoshinsky, DColi, RJhawar, NBora, EJacques-O'Hagan, SWu, J Beyond the MEK-pocket: can current MEK kinase inhibitors be utilized to synthesize novel type III NCKIs? Does the MEK-pocket exist in kinases other than MEK? Bioorg Med Chem Lett19:226-9 (2008) 
 
Protein kinase C beta type
Name:Protein kinase C beta type
Type:Enzyme
Mol. Mass.:76873.67
Organism:Homo sapiens (Human)
Description:The recombinant human PKC enzymes were produced using a baculovirus expression system in SF9 cells
Residue:671
BDBM50255049
NameBDBM50255049
Synonyms:5-{[2-(4-Chloro-benzenesulfonyl)-acetyl]-hydrazonomethyl}-3,4-difluoro-2-(2-fluoro-4-iodo-phenylamino)-benzoic acid | CHEMBL481969
TypeSmall organic molecule
Emp. Form.C22H14ClF3IN3O5S
Mol. Mass.651.781
SMILESOC(=O)c1cc(C=NNC(=O)CS(=O)(=O)c2ccc(Cl)cc2)c(F)c(F)c1Nc1ccc(I)cc1F