Reaction Details
TargetGlucocorticoid receptor
LigandBDBM50412605
Substrate/Competitorn/a
Meas. Tech.ChEMBL_558475 (CHEMBL963881)
IC50 125±n/a nM
Citation Barnett, HACoe, DMCooper, TWJack, TIJones, HTMacdonald, SJMcLay, IMRayner, NSasse, RZShipley, TJSkone, PASomers, GITaylor, SUings, IJWoolven, JMWeingarten, GG Aryl aminopyrazole benzamides as oral non-steroidal selective glucocorticoid receptor agonists. Bioorg Med Chem Lett19:158-62 (2008) 
 
Glucocorticoid receptor
Name:Glucocorticoid receptor
Type:Enzyme
Mol. Mass.:85656.87
Organism:Homo sapiens (Human)
Description:P04150
Residue:777
BDBM50412605
NameBDBM50412605
Synonyms:CHEMBL481185
TypeSmall organic molecule
Emp. Form.C23H23F4N5O3
Mol. Mass.493.454
SMILESCCN(CC(O)(CNC(=O)c1cnn(c1N)-c1ccc(F)cc1)C(F)(F)F)C(=O)c1ccccc1