Reaction Details
TargetProstaglandin E2 receptor EP3 subtype
LigandBDBM50254729
Substrate/Competitorn/a
Meas. Tech.ChEMBL_558516 (CHEMBL963082)
IC50 3.6±n/a nM
Citation Zhou, NZeller, WKrohn, MAnderson, HZhang, JOnua, EKiselyov, ASRamirez, JHalldorsdottir, GAndrésson, TGurney, MESingh, J 3,4-Disubstituted indole acylsulfonamides: a novel series of potent and selective human EP3 receptor antagonists. Bioorg Med Chem Lett19:123-6 (2008) 
 
Prostaglandin E2 receptor EP3 subtype
Name:Prostaglandin E2 receptor EP3 subtype
Type:Enzyme
Mol. Mass.:43335.03
Organism:Homo sapiens (Human)
Description:P43115
Residue:390
BDBM50254729
NameBDBM50254729
Synonyms:CHEMBL517165 | N-(5-chlorothiophen-2-ylsulfonyl)-2-(3-(naphthalen-2-ylthio)-1H-indol-4-yloxy)acetamide
TypeSmall organic molecule
Emp. Form.C24H17ClN2O4S3
Mol. Mass.529.051
SMILESClc1ccc(s1)S(=O)(=O)NC(=O)COc1cccc2[nH]cc(Sc3ccc4ccccc4c3)c12