Reaction Details
TargetProstaglandin E2 receptor EP3 subtype
LigandBDBM50254768
Substrate/Competitorn/a
Meas. Tech.ChEMBL_558516 (CHEMBL963082)
IC50 5.2±n/a nM
Citation Zhou, NZeller, WKrohn, MAnderson, HZhang, JOnua, EKiselyov, ASRamirez, JHalldorsdottir, GAndrésson, TGurney, MESingh, J 3,4-Disubstituted indole acylsulfonamides: a novel series of potent and selective human EP3 receptor antagonists. Bioorg Med Chem Lett19:123-6 (2008) 
 
Prostaglandin E2 receptor EP3 subtype
Name:Prostaglandin E2 receptor EP3 subtype
Type:Enzyme
Mol. Mass.:43335.03
Organism:Homo sapiens (Human)
Description:P43115
Residue:390
BDBM50254768
NameBDBM50254768
Synonyms:CHEMBL518396 | N-(4,5-dichlorothiophen-2-ylsulfonyl)-2-(3-(2,4-dimethylphenylthio)-1H-indol-4-yloxy)acetamide
TypeSmall organic molecule
Emp. Form.C22H18Cl2N2O4S3
Mol. Mass.541.49
SMILESCc1ccc(Sc2c[nH]c3cccc(OCC(=O)NS(=O)(=O)c4cc(Cl)c(Cl)s4)c23)c(C)c1