Reaction Details
TargetProstaglandin E2 receptor EP3 subtype
LigandBDBM50254839
Substrate/Competitorn/a
Meas. Tech.ChEMBL_558516 (CHEMBL963082)
IC50 3.9±n/a nM
Citation Zhou, NZeller, WKrohn, MAnderson, HZhang, JOnua, EKiselyov, ASRamirez, JHalldorsdottir, GAndrésson, TGurney, MESingh, J 3,4-Disubstituted indole acylsulfonamides: a novel series of potent and selective human EP3 receptor antagonists. Bioorg Med Chem Lett19:123-6 (2008) 
 
Prostaglandin E2 receptor EP3 subtype
Name:Prostaglandin E2 receptor EP3 subtype
Type:Enzyme
Mol. Mass.:43335.03
Organism:Homo sapiens (Human)
Description:P43115
Residue:390
BDBM50254839
NameBDBM50254839
Synonyms:CHEMBL520933 | N-(4,5-dichlorothiophen-2-ylsulfonyl)-2-(3-(quinolin-2-ylthio)-1H-indol-4-yloxy)acetamide
TypeSmall organic molecule
Emp. Form.C23H15Cl2N3O4S3
Mol. Mass.564.484
SMILESClc1cc(sc1Cl)S(=O)(=O)NC(=O)COc1cccc2[nH]cc(Sc3ccc4ccccc4n3)c12