Reaction Details
TargetProstaglandin E2 receptor EP3 subtype
LigandBDBM50254882
Substrate/Competitorn/a
Meas. Tech.ChEMBL_558516 (CHEMBL963082)
IC50 4.1±n/a nM
Citation Zhou, NZeller, WKrohn, MAnderson, HZhang, JOnua, EKiselyov, ASRamirez, JHalldorsdottir, GAndrésson, TGurney, MESingh, J 3,4-Disubstituted indole acylsulfonamides: a novel series of potent and selective human EP3 receptor antagonists. Bioorg Med Chem Lett19:123-6 (2008) 
 
Prostaglandin E2 receptor EP3 subtype
Name:Prostaglandin E2 receptor EP3 subtype
Type:Enzyme
Mol. Mass.:43335.03
Organism:Homo sapiens (Human)
Description:P43115
Residue:390
BDBM50254882
NameBDBM50254882
Synonyms:2-(3-(4-chlorophenylthio)-1H-indol-4-yloxy)-N-(4,5-dichlorothiophen-2-ylsulfonyl)acetamide | CHEMBL479433
TypeSmall organic molecule
Emp. Form.C20H13Cl3N2O4S3
Mol. Mass.547.882
SMILESClc1cc(sc1Cl)S(=O)(=O)NC(=O)COc1cccc2[nH]cc(Sc3ccc(Cl)cc3)c12