Reaction Details
TargetProstaglandin E2 receptor EP3 subtype
LigandBDBM50254642
Substrate/Competitorn/a
Meas. Tech.ChEMBL_558515 (CHEMBL963081)
IC50 3±n/a nM
Citation Zhou, NZeller, WKrohn, MAnderson, HZhang, JOnua, EKiselyov, ASRamirez, JHalldorsdottir, GAndrésson, TGurney, MESingh, J 3,4-Disubstituted indole acylsulfonamides: a novel series of potent and selective human EP3 receptor antagonists. Bioorg Med Chem Lett19:123-6 (2008) 
 
Prostaglandin E2 receptor EP3 subtype
Name:Prostaglandin E2 receptor EP3 subtype
Type:Enzyme
Mol. Mass.:43335.03
Organism:Homo sapiens (Human)
Description:P43115
Residue:390
BDBM50254642
NameBDBM50254642
Synonyms:2-(3-(naphthalen-2-ylthio)-1H-indol-4-yloxy)-N-(thiophen-2-ylsulfonyl)acetamide | CHEMBL520290
TypeSmall organic molecule
Emp. Form.C24H18N2O4S3
Mol. Mass.494.606
SMILESO=C(COc1cccc2[nH]cc(Sc3ccc4ccccc4c3)c12)NS(=O)(=O)c1cccs1