Reaction Details
TargetProstaglandin E2 receptor EP3 subtype
LigandBDBM50254643
Substrate/Competitorn/a
Meas. Tech.ChEMBL_558515 (CHEMBL963081)
IC50 3.6±n/a nM
Citation Zhou, NZeller, WKrohn, MAnderson, HZhang, JOnua, EKiselyov, ASRamirez, JHalldorsdottir, GAndrésson, TGurney, MESingh, J 3,4-Disubstituted indole acylsulfonamides: a novel series of potent and selective human EP3 receptor antagonists. Bioorg Med Chem Lett19:123-6 (2008) 
 
Prostaglandin E2 receptor EP3 subtype
Name:Prostaglandin E2 receptor EP3 subtype
Type:Enzyme
Mol. Mass.:43335.03
Organism:Homo sapiens (Human)
Description:P43115
Residue:390
BDBM50254643
NameBDBM50254643
Synonyms:CHEMBL481589 | N-(3,5-dichlorophenylsulfonyl)-2-(3-(naphthalen-2-ylthio)-1H-indol-4-yloxy)acetamide
TypeSmall organic molecule
Emp. Form.C26H18Cl2N2O4S2
Mol. Mass.557.468
SMILESClc1cc(Cl)cc(c1)S(=O)(=O)NC(=O)COc1cccc2[nH]cc(Sc3ccc4ccccc4c3)c12