Reaction Details
TargetProstaglandin E2 receptor EP3 subtype
LigandBDBM50254728
Substrate/Competitorn/a
Meas. Tech.ChEMBL_558515 (CHEMBL963081)
IC50 0.7±n/a nM
Citation Zhou, NZeller, WKrohn, MAnderson, HZhang, JOnua, EKiselyov, ASRamirez, JHalldorsdottir, GAndrésson, TGurney, MESingh, J 3,4-Disubstituted indole acylsulfonamides: a novel series of potent and selective human EP3 receptor antagonists. Bioorg Med Chem Lett19:123-6 (2008) 
 
Prostaglandin E2 receptor EP3 subtype
Name:Prostaglandin E2 receptor EP3 subtype
Type:Enzyme
Mol. Mass.:43335.03
Organism:Homo sapiens (Human)
Description:P43115
Residue:390
BDBM50254728
NameBDBM50254728
Synonyms:CHEMBL465947 | N-(4-methoxyphenylsulfonyl)-2-(3-(naphthalen-2-ylthio)-1H-indol-4-yloxy)acetamide
TypeSmall organic molecule
Emp. Form.C27H22N2O5S2
Mol. Mass.518.604
SMILESCOc1ccc(cc1)S(=O)(=O)NC(=O)COc1cccc2[nH]cc(Sc3ccc4ccccc4c3)c12