Reaction Details
TargetProstaglandin E2 receptor EP3 subtype
LigandBDBM50254883
Substrate/Competitorn/a
Meas. Tech.ChEMBL_558515 (CHEMBL963081)
IC50 0.5±n/a nM
Citation Zhou, NZeller, WKrohn, MAnderson, HZhang, JOnua, EKiselyov, ASRamirez, JHalldorsdottir, GAndrésson, TGurney, MESingh, J 3,4-Disubstituted indole acylsulfonamides: a novel series of potent and selective human EP3 receptor antagonists. Bioorg Med Chem Lett19:123-6 (2008) 
 
Prostaglandin E2 receptor EP3 subtype
Name:Prostaglandin E2 receptor EP3 subtype
Type:Enzyme
Mol. Mass.:43335.03
Organism:Homo sapiens (Human)
Description:P43115
Residue:390
BDBM50254883
NameBDBM50254883
Synonyms:CHEMBL479434 | N-(4,5-dichlorothiophen-2-ylsulfonyl)-2-(3-(4-methoxyphenylthio)-1H-indol-4-yloxy)acetamide
TypeSmall organic molecule
Emp. Form.C21H16Cl2N2O5S3
Mol. Mass.543.463
SMILESCOc1ccc(Sc2c[nH]c3cccc(OCC(=O)NS(=O)(=O)c4cc(Cl)c(Cl)s4)c23)cc1