Reaction Details
TargetDual specificity protein phosphatase 1
LigandBDBM50099736
Substrate/Competitorn/a
Meas. Tech.ChEMBL_565116 (CHEMBL965760)
IC50 820±n/a nM
Citation Cao, SMurphy, BTFoster, CLazo, JSKingston, DG Bioactivities of simplified adociaquinone B and naphthoquinone derivatives against Cdc25B, MKP-1, and MKP-3 phosphatases. Bioorg Med Chem17:2276-81 (2009) 
 
Dual specificity protein phosphatase 1
Name:Dual specificity protein phosphatase 1
Type:PROTEIN
Mol. Mass.:39372.46
Organism:Mus musculus
Description:ChEMBL_565116
Residue:367
BDBM50099736
NameBDBM50099736
Synonyms:4-Ethoxy-[1,2]naphthoquinone CHEMBL50620
TypeSmall organic molecule
Emp. Form.C12H10O3
Mol. Mass.202.206
SMILESCCOC1=CC(=O)C(=O)c2ccccc12