Reaction Details
TargetDual specificity protein phosphatase 1
LigandBDBM50267086
Substrate/Competitorn/a
Meas. Tech.ChEMBL_565116 (CHEMBL965760)
IC50 1100±n/a nM
Citation Cao, SMurphy, BTFoster, CLazo, JSKingston, DG Bioactivities of simplified adociaquinone B and naphthoquinone derivatives against Cdc25B, MKP-1, and MKP-3 phosphatases. Bioorg Med Chem17:2276-81 (2009) 
 
Dual specificity protein phosphatase 1
Name:Dual specificity protein phosphatase 1
Type:PROTEIN
Mol. Mass.:39372.46
Organism:Mus musculus
Description:ChEMBL_565116
Residue:367
BDBM50267086
NameBDBM50267086
Synonyms:Adociaquinone B | CHEMBL476648
TypeSmall organic molecule
Emp. Form.C22H17NO6S
Mol. Mass.423.438
SMILESC[C@@]12CCCc3coc(c13)C(=O)c1cc3C(=O)C4=NCCS(=O)(=O)C4C(=O)c3cc21