Reaction Details
TargetDual specificity protein phosphatase 6
LigandBDBM50060898
Substrate/Competitorn/a
Meas. Tech.ChEMBL_565117 (CHEMBL955131)
IC50 6900±n/a nM
Citation Cao, SMurphy, BTFoster, CLazo, JSKingston, DG Bioactivities of simplified adociaquinone B and naphthoquinone derivatives against Cdc25B, MKP-1, and MKP-3 phosphatases. Bioorg Med Chem17:2276-81 (2009) 
 
Dual specificity protein phosphatase 6
Name:Dual specificity protein phosphatase 6
Type:Enzyme
Mol. Mass.:42303.19
Organism:Rattus norvegicus
Description:gi_16758752
Residue:381
BDBM50060898
NameBDBM50060898
Synonyms:5,8-Dihydroxy-[1,4]naphthoquinone 5,8-dihydroxy-1,4-naphthoquinone naphthazalin
TypeSmall organic molecule
Emp. Form.C10H6O4
Mol. Mass.190.1522
SMILESOc1ccc(O)c2C(=O)C=CC(=O)c12