Reaction Details
TargetEphrin type-A receptor 1
LigandBDBM26145
Substrate/Competitorn/a
Meas. Tech.ChEMBL_537107 (CHEMBL988939)
Kd 5±n/a nM
Citation Bamborough, PDrewry, DHarper, GSmith, GKSchneider, K Assessment of chemical coverage of kinome space and its implications for kinase drug discovery. J Med Chem51:7898-914 (2008) 
 
Ephrin type-A receptor 1
Name:Ephrin type-A receptor 1
Type:Enzyme
Mol. Mass.:108128.04
Organism:Homo sapiens (Human)
Description:P21709
Residue:976
BDBM26145
NameBDBM26145
Synonyms:2,4-dianilino pyrimidine, 2 CHEMBL249097
TypeSmall organic molecule
Emp. Form.C18H17N5O2
Mol. Mass.335.3599
SMILESCc1ccc(O)cc1Nc1ccnc(Nc2cccc(c2)C(N)=O)n1