Reaction Details
TargetMyosin light chain kinase, smooth muscle
LigandBDBM8344
Substrate/Competitorn/a
Meas. Tech.ChEMBL_537112 (CHEMBL988944)
Kd 150±n/a nM
Citation Bamborough, PDrewry, DHarper, GSmith, GKSchneider, K Assessment of chemical coverage of kinome space and its implications for kinase drug discovery. J Med Chem51:7898-914 (2008) 
 
Myosin light chain kinase, smooth muscle
Name:Myosin light chain kinase, smooth muscle
Type:Protein
Mol. Mass.:210702.56
Organism:Homo sapiens (Human)
Description:Q15746
Residue:1914
BDBM8344
NameBDBM8344
Synonyms:6-aryl-pyrazolo[3,4-b]pyridine analogue 8 N-[6-(3-hydroxyphenyl)-1H-pyrazolo[3,4-b]pyridin-3-yl]cyclopropanecarboxamide | pyrazolo[3,4-b]pyridine analogue 10
TypeSmall organic molecule
Emp. Form.C16H14N4O2
Mol. Mass.294.308
SMILESOc1cccc(c1)-c1ccc2c(NC(=O)C3CC3)n[nH]c2n1