Reaction Details
TargetEphrin type-B receptor 2
LigandBDBM26145
Substrate/Competitorn/a
Meas. Tech.ChEMBL_537104 (CHEMBL988936)
Kd 7±n/a nM
Citation Bamborough, PDrewry, DHarper, GSmith, GKSchneider, K Assessment of chemical coverage of kinome space and its implications for kinase drug discovery. J Med Chem51:7898-914 (2008) 
 
Ephrin type-B receptor 2
Name:Ephrin type-B receptor 2
Type:PROTEIN
Mol. Mass.:117491.44
Organism:Homo sapiens (Human)
Description:ChEMBL_1476221
Residue:1055
BDBM26145
NameBDBM26145
Synonyms:2,4-dianilino pyrimidine, 2 CHEMBL249097
TypeSmall organic molecule
Emp. Form.C18H17N5O2
Mol. Mass.335.3599
SMILESCc1ccc(O)cc1Nc1ccnc(Nc2cccc(c2)C(N)=O)n1