Reaction Details
TargetEphrin type-A receptor 2
LigandBDBM26145
Substrate/Competitorn/a
Meas. Tech.ChEMBL_537106 (CHEMBL988938)
Kd 8±n/a nM
Citation Bamborough, PDrewry, DHarper, GSmith, GKSchneider, K Assessment of chemical coverage of kinome space and its implications for kinase drug discovery. J Med Chem51:7898-914 (2008) 
 
Ephrin type-A receptor 2
Name:Ephrin type-A receptor 2
Type:PROTEIN
Mol. Mass.:108260.70
Organism:Homo sapiens (Human)
Description:ChEMBL_1505248
Residue:976
BDBM26145
NameBDBM26145
Synonyms:2,4-dianilino pyrimidine, 2 CHEMBL249097
TypeSmall organic molecule
Emp. Form.C18H17N5O2
Mol. Mass.335.3599
SMILESCc1ccc(O)cc1Nc1ccnc(Nc2cccc(c2)C(N)=O)n1