Reaction Details
TargetCyclin-G-associated kinase
LigandBDBM50273636
Substrate/Competitorn/a
Meas. Tech.ChEMBL_537121 (CHEMBL988955)
Kd 367±n/a nM
Citation Bamborough, PDrewry, DHarper, GSmith, GKSchneider, K Assessment of chemical coverage of kinome space and its implications for kinase drug discovery. J Med Chem51:7898-914 (2008) 
 
Cyclin-G-associated kinase
Name:Cyclin-G-associated kinase
Type:PROTEIN
Mol. Mass.:143171.28
Organism:Homo sapiens (Human)
Description:ChEMBL_1478229
Residue:1311
BDBM50273636
NameBDBM50273636
Synonyms:4-(5-(4-fluorophenyl)-1H-pyrazol-3-ylamino)benzamide | CHEMBL511337
TypeSmall organic molecule
Emp. Form.C16H13FN4O
Mol. Mass.296.299
SMILESNC(=O)c1ccc(Nc2cc(n[nH]2)-c2ccc(F)cc2)cc1