Reaction Details
TargetTyrosine-protein kinase FRK
LigandBDBM50273637
Substrate/Competitorn/a
Meas. Tech.ChEMBL_537126 (CHEMBL988960)
Kd 6±n/a nM
Citation Bamborough, PDrewry, DHarper, GSmith, GKSchneider, K Assessment of chemical coverage of kinome space and its implications for kinase drug discovery. J Med Chem51:7898-914 (2008) 
 
Tyrosine-protein kinase FRK
Name:Tyrosine-protein kinase FRK
Type:Tyrosine-protein kinase
Mol. Mass.:58254.41
Organism:Homo sapiens (Human)
Description:P42685
Residue:505
BDBM50273637
NameBDBM50273637
Synonyms:3-(4-amino-7-(piperidin-4-yl)-7H-pyrrolo[2,3-d]pyrimidin-5-yl)phenol | CHEMBL450519
TypeSmall organic molecule
Emp. Form.C17H19N5O
Mol. Mass.309.3657
SMILESNc1ncnc2n(cc(-c3cccc(O)c3)c12)C1CCNCC1