Reaction Details
TargetRAC-gamma serine/threonine-protein kinase
LigandBDBM50241256
Substrate/Competitorn/a
Meas. Tech.ChEMBL_538130 (CHEMBL1025773)
Kd>10000±n/a nM
Citation Bamborough, PDrewry, DHarper, GSmith, GKSchneider, K Assessment of chemical coverage of kinome space and its implications for kinase drug discovery. J Med Chem51:7898-914 (2008) 
 
RAC-gamma serine/threonine-protein kinase
Name:RAC-gamma serine/threonine-protein kinase
Type:Enzyme
Mol. Mass.:55769.36
Organism:Homo sapiens (Human)
Description:n/a
Residue:479
BDBM50241256
NameBDBM50241256
Synonyms:CHEMBL233000 | N-(3-cyano-4,5,6,7-tetrahydrobenzo[b]thiophen-2-yl)benzamide
TypeSmall organic molecule
Emp. Form.C16H14N2OS
Mol. Mass.282.36
SMILESO=C(Nc1sc2CCCCc2c1C#N)c1ccccc1