Reaction Details
TargetTyrosine-protein kinase receptor UFO
LigandBDBM50273541
Substrate/Competitorn/a
Meas. Tech.ChEMBL_537067 (CHEMBL986216)
Kd 596±n/a nM
Citation Bamborough, PDrewry, DHarper, GSmith, GKSchneider, K Assessment of chemical coverage of kinome space and its implications for kinase drug discovery. J Med Chem51:7898-914 (2008) 
 
Tyrosine-protein kinase receptor UFO
Name:Tyrosine-protein kinase receptor UFO
Type:Enzyme
Mol. Mass.:98316.97
Organism:Homo sapiens (Human)
Description:P30530
Residue:894
BDBM50273541
NameBDBM50273541
Synonyms:CHEMBL516312 | N-(5-(4-cyanophenyl)-1H-pyrrolo[2,3-b]pyridin-3-yl)nicotinamide
TypeSmall organic molecule
Emp. Form.C20H13N5O
Mol. Mass.339.3501
SMILESO=C(Nc1c[nH]c2ncc(cc12)-c1ccc(cc1)C#N)c1cccnc1