Reaction Details
TargetSerine/threonine-protein kinase BRSK2
LigandBDBM50273571
Substrate/Competitorn/a
Meas. Tech.ChEMBL_537077 (CHEMBL988909)
Kd 92±n/a nM
Citation Bamborough, PDrewry, DHarper, GSmith, GKSchneider, K Assessment of chemical coverage of kinome space and its implications for kinase drug discovery. J Med Chem51:7898-914 (2008) 
 
Serine/threonine-protein kinase BRSK2
Name:Serine/threonine-protein kinase BRSK2
Type:PROTEIN
Mol. Mass.:81657.07
Organism:Homo sapiens (Human)
Description:ChEMBL_586949
Residue:736
BDBM50273571
NameBDBM50273571
Synonyms:CHEMBL514409 N-(2-oxo-3-(phenyl(4-(piperidin-1-ylmethyl)phenylamino)methylene)indolin-5-yl)ethanesulfonamide | TCMDC-135395
TypeSmall organic molecule
Emp. Form.C29H32N4O3S
Mol. Mass.516.654
SMILESCCS(=O)(=O)Nc1ccc2NC(=O)C(C(=Nc3ccc(CN4CCCCC4)cc3)c3ccccc3)c2c1