Reaction Details
TargetAdenosine receptor A1
LigandBDBM50279464
Substrate/Competitorn/a
Meas. Tech.ChEMBL_545004 (CHEMBL1014639)
Ki 1600±n/a nM
Citation Bansal, RKumar, GGandhi, DYoung, LCHarvey, AL Synthesis of a series of 8-(substituted-phenyl)xanthines and a study on the effects of substitution pattern of phenyl substituents on affinity for adenosine A(1) and A(2A) receptors. Eur J Med Chem44:2122-7 (2009) 
 
Adenosine receptor A1
Name:Adenosine receptor A1
Type:G Protein-Coupled Receptor (GPCR)
Mol. Mass.:36520.92
Organism:Homo sapiens (Human)
Description:P30542
Residue:326
BDBM50279464
NameBDBM50279464
Synonyms:1,3-Dimethyl-8-[3-(2-pyrrolidin-1-ylethoxy)-phenyl]xanthine | CHEMBL486316
TypeSmall organic molecule
Emp. Form.C19H23N5O3
Mol. Mass.369.4176
SMILESCn1c2nc([nH]c2c(=O)n(C)c1=O)-c1cccc(OCCN2CCCC2)c1