Reaction Details
TargetAdenosine receptor A2a
LigandBDBM50279447
Substrate/Competitorn/a
Meas. Tech.ChEMBL_545005 (CHEMBL1014640)
Ki 800±n/a nM
Citation Bansal, RKumar, GGandhi, DYoung, LCHarvey, AL Synthesis of a series of 8-(substituted-phenyl)xanthines and a study on the effects of substitution pattern of phenyl substituents on affinity for adenosine A(1) and A(2A) receptors. Eur J Med Chem44:2122-7 (2009) 
 
Adenosine receptor A2a
Name:Adenosine receptor A2a
Type:G Protein-Coupled Receptor (GPCR)
Mol. Mass.:44716.46
Organism:Homo sapiens (Human)
Description:P29274
Residue:412
BDBM50279447
NameBDBM50279447
Synonyms:1,3-Dimethyl-8-[3-(2-piperidin-4-ylethoxy)phenyl]xanthine | CHEMBL488366
TypeSmall organic molecule
Emp. Form.C20H25N5O3
Mol. Mass.383.4442
SMILESCn1c2nc([nH]c2c(=O)n(C)c1=O)-c1cccc(OCCN2CCCCC2)c1