Reaction Details
TargetProstaglandin E2 receptor EP1 subtype
LigandBDBM50413674
Substrate/Competitorn/a
Meas. Tech.ChEMBL_544164 (CHEMBL1014228)
IC50 10±n/a nM
Citation Hall, ABrown, SHBudd, CClayton, NMGiblin, GMGoldsmith, PHayhow, TGHurst, DNNaylor, AAnthony Rawlings, DScoccitti, TWilson, AWWinchester, WJ Discovery of GSK345931A: An EP(1) receptor antagonist with efficacy in preclinical models of inflammatory pain. Bioorg Med Chem Lett19:497-501 (2008) 
 
Prostaglandin E2 receptor EP1 subtype
Name:Prostaglandin E2 receptor EP1 subtype
Type:Enzyme
Mol. Mass.:41834.57
Organism:Homo sapiens (Human)
Description:P34995
Residue:402
BDBM50413674
NameBDBM50413674
Synonyms:CHEMBL456495
TypeSmall organic molecule
Emp. Form.C28H22ClNO4
Mol. Mass.471.932
SMILESCC(=O)Nc1cc(cc(c1)-c1ccccc1-c1cc(Cl)ccc1OCc1ccccc1)C(O)=O