Reaction Details
TargetProstaglandin E2 receptor EP1 subtype
LigandBDBM50413681
Substrate/Competitorn/a
Meas. Tech.ChEMBL_544164 (CHEMBL1014228)
IC50 100±n/a nM
Citation Hall, ABrown, SHBudd, CClayton, NMGiblin, GMGoldsmith, PHayhow, TGHurst, DNNaylor, AAnthony Rawlings, DScoccitti, TWilson, AWWinchester, WJ Discovery of GSK345931A: An EP(1) receptor antagonist with efficacy in preclinical models of inflammatory pain. Bioorg Med Chem Lett19:497-501 (2008) 
 
Prostaglandin E2 receptor EP1 subtype
Name:Prostaglandin E2 receptor EP1 subtype
Type:Enzyme
Mol. Mass.:41834.57
Organism:Homo sapiens (Human)
Description:P34995
Residue:402
BDBM50413681
NameBDBM50413681
Synonyms:CHEMBL458008
TypeSmall organic molecule
Emp. Form.C27H20ClO3
Mol. Mass.427.899
SMILESCc1cccc(-c2cc(Cl)ccc2OCc2ccccc2)c1-c1cccc(c1)C([O-])=O