Reaction Details
TargetProstaglandin E2 receptor EP1 subtype
LigandBDBM50413686
Substrate/Competitorn/a
Meas. Tech.ChEMBL_544164 (CHEMBL1014228)
IC50 125.89±n/a nM
Citation Hall, ABrown, SHBudd, CClayton, NMGiblin, GMGoldsmith, PHayhow, TGHurst, DNNaylor, AAnthony Rawlings, DScoccitti, TWilson, AWWinchester, WJ Discovery of GSK345931A: An EP(1) receptor antagonist with efficacy in preclinical models of inflammatory pain. Bioorg Med Chem Lett19:497-501 (2008) 
 
Prostaglandin E2 receptor EP1 subtype
Name:Prostaglandin E2 receptor EP1 subtype
Type:Enzyme
Mol. Mass.:41834.57
Organism:Homo sapiens (Human)
Description:P34995
Residue:402
BDBM50413686
NameBDBM50413686
Synonyms:CHEMBL457797
TypeSmall organic molecule
Emp. Form.C26H19ClO3
Mol. Mass.414.88
SMILESOC(=O)c1cc(ccc1Cl)-c1ccccc1-c1ccccc1OCc1ccccc1