Reaction Details
TargetSuppressor of tumorigenicity 14 protein
LigandBDBM23917
Substrate/Competitorn/a
Meas. Tech.ChEMBL_559006 (CHEMBL1010203)
Ki 3.8±n/a nM
Citation Steinmetzer, TDönnecke, DKorsonewski, MNeuwirth, CSteinmetzer, PSchulze, ASaupe, SMSchweinitz, A Modification of the N-terminal sulfonyl residue in 3-amidinophenylalanine-based matriptase inhibitors. Bioorg Med Chem Lett19:67-73 (2008) 
 
Suppressor of tumorigenicity 14 protein
Name:Suppressor of tumorigenicity 14 protein
Type:Single-pass type II membrane protein
Mol. Mass.:94769.23
Organism:Homo sapiens (Human)
Description:Q9Y5Y6
Residue:855
BDBM23917
NameBDBM23917
Synonyms:3-amidinophenylalanine deriv., 59 CHEMBL379194
TypeSmall organic molecule
Emp. Form.C26H37N7O4S
Mol. Mass.543.681
SMILESNCCC1CCN(CC1)C(=O)[C@H](Cc1cccc(c1)C(N)=N)NS(=O)(=O)c1cccc(NC(=O)CCN)c1