Reaction Details
TargetTransient receptor potential cation channel subfamily V member 1
LigandBDBM50254325
Substrate/Competitorn/a
Meas. Tech.ChEMBL_559247 (CHEMBL1014666)
IC50 11±n/a nM
Citation Lebsack, ADBranstetter, BJHack, MDXiao, WPeterson, MLNasser, NMaher, MPAo, HBhattacharya, AKansagara, MScott, BPLuo, LRynberg, RRizzolio, MChaplan, SRWickenden, ADGuy Breitenbucher, J Identification and synthesis of 2,7-diamino-thiazolo[5,4-d]pyrimidine derivatives as TRPV1 antagonists. Bioorg Med Chem Lett19:40-6 (2008) 
 
Transient receptor potential cation channel subfamily V member 1
Name:Transient receptor potential cation channel subfamily V member 1
Type:Protein
Mol. Mass.:94960.75
Organism:Homo sapiens (Human)
Description:Q8NER1
Residue:839
BDBM50254325
NameBDBM50254325
Synonyms:CHEMBL469302 | N7-(4-tert-butylphenyl)-N2-(2,6-dichlorophenyl)thiazolo[5,4-d]pyrimidine-2,7-diamine
TypeSmall organic molecule
Emp. Form.C21H19Cl2N5S
Mol. Mass.444.38
SMILESCC(C)(C)c1ccc(Nc2ncnc3sc(Nc4c(Cl)cccc4Cl)nc23)cc1