Reaction Details
TargetTransient receptor potential cation channel subfamily V member 1
LigandBDBM50254080
Substrate/Competitorn/a
Meas. Tech.ChEMBL_559248 (CHEMBL1014667)
IC50 0.500000±n/a nM
Citation Lebsack, ADBranstetter, BJHack, MDXiao, WPeterson, MLNasser, NMaher, MPAo, HBhattacharya, AKansagara, MScott, BPLuo, LRynberg, RRizzolio, MChaplan, SRWickenden, ADGuy Breitenbucher, J Identification and synthesis of 2,7-diamino-thiazolo[5,4-d]pyrimidine derivatives as TRPV1 antagonists. Bioorg Med Chem Lett19:40-6 (2008) 
 
Transient receptor potential cation channel subfamily V member 1
Name:Transient receptor potential cation channel subfamily V member 1
Type:Transient Receptor
Mol. Mass.:94956.12
Organism:Rattus norvegicus (rat)
Description:O35433
Residue:838
BDBM50254080
NameBDBM50254080
Synonyms:(3,5-dichloro-4-(7-(4-(trifluoromethyl)phenylamino)thiazolo[5,4-d]pyrimidin-2-ylamino)phenyl)methanol | CHEMBL516769
TypeSmall organic molecule
Emp. Form.C19H12Cl2F3N5OS
Mol. Mass.486.298
SMILESOCc1cc(Cl)c(Nc2nc3c(Nc4ccc(cc4)C(F)(F)F)ncnc3s2)c(Cl)c1