Reaction Details
TargetCoagulation factor X
LigandBDBM50266011
Substrate/Competitorn/a
Meas. Tech.ChEMBL_544730 (CHEMBL1010168)
Ki 0.05±n/a nM
Citation Qiao, JXKing, SRHe, KWong, PCRendina, ARLuettgen, JMXin, BKnabb, RMWexler, RRLam, PY Highly efficacious factor Xa inhibitors containing alpha-substituted phenylcycloalkyl P4 moieties. Bioorg Med Chem Lett19:462-8 (2008) 
 
Coagulation factor X
Name:Coagulation factor X
Type:Enzyme
Mol. Mass.:54726.60
Organism:Homo sapiens (Human)
Description:n/a
Residue:488
BDBM50266011
NameBDBM50266011
Synonyms:6-(4-(1-((dimethylamino)methyl)cyclopropyl)phenyl)-1-(4-methoxyphenyl)-7-oxo-4,5,6,7-tetrahydro-1H-pyrazolo[3,4-c]pyridine-3-carbonitrile 2,2,2-trifluoroacetate | CHEMBL518253
TypeSmall organic molecule
Emp. Form.C26H27N5O2
Mol. Mass.441.5249
SMILESCOc1ccc(cc1)-n1nc(C#N)c2CCN(C(=O)c12)c1ccc(cc1)C1(CN(C)C)CC1