Reaction Details
TargetBaculoviral IAP repeat-containing protein 8
LigandBDBM50273673
Substrate/Competitorn/a
Meas. Tech.ChEMBL_537310 (CHEMBL985406)
Ki 4.6±n/a nM
Citation Peng, YSun, HNikolovska-Coleska, ZQiu, SYang, CYLu, JCai, QYi, HKang, SYang, DWang, S Potent, orally bioavailable diazabicyclic small-molecule mimetics of second mitochondria-derived activator of caspases. J Med Chem51:8158-62 (2008) 
 
Baculoviral IAP repeat-containing protein 8
Name:Baculoviral IAP repeat-containing protein 8
Type:PROTEIN
Mol. Mass.:27091.98
Organism:Homo sapiens (Human)
Description:ChEMBL_537310
Residue:236
BDBM50273673
NameBDBM50273673
Synonyms:(5S,8S,10aR)-N-Benzhydryl-5-((S)-2-(methylamino)propanamido)-6-oxodeca-hydropyrrolo[1,2-a][1,5]diazocine-8-carboxamide | CHEMBL459541
TypeSmall organic molecule
Emp. Form.C27H35N5O3
Mol. Mass.477.5985
SMILESCN[C@@H](C)C(=O)N[C@H]1CNCC[C@H]2CC[C@H](N2C1=O)C(=O)NC(c1ccccc1)c1ccccc1