Reaction Details
TargetCaspase-3
LigandBDBM50273929
Substrate/Competitorn/a
Meas. Tech.ChEMBL_537865 (CHEMBL990676)
EC50 12.4±n/a nM
Citation Smith, GGlaser, MPerumal, MNguyen, QDShan, BArstad, EAboagye, EO Design, synthesis, and biological characterization of a caspase 3/7 selective isatin labeled with 2-[18F]fluoroethylazide. J Med Chem51:8057-67 (2008) 
 
Caspase-3
Name:Caspase-3
Type:Hydrolase; heterotetramer of two heterodimers
Mol. Mass.:31607.55
Organism:Homo sapiens (Human)
Description:n/a
Residue:277
BDBM50273929
NameBDBM50273929
Synonyms:(S)-1-(4-Fluorobenzyl)-5-(2-(2,4-difluorophenoxymethyl)-pyrrolidine-1-sulfonyl)isatin | CHEMBL516941
TypeSmall organic molecule
Emp. Form.C26H21F3N2O5S
Mol. Mass.530.516
SMILESFc1ccc(CN2C(=O)C(=O)c3cc(ccc23)S(=O)(=O)N2CCC[C@H]2COc2ccc(F)cc2F)cc1