Reaction Details
TargetCaspase-3
LigandBDBM50273991
Substrate/Competitorn/a
Meas. Tech.ChEMBL_537865 (CHEMBL990676)
EC50 5.5±n/a nM
Citation Smith, GGlaser, MPerumal, MNguyen, QDShan, BArstad, EAboagye, EO Design, synthesis, and biological characterization of a caspase 3/7 selective isatin labeled with 2-[18F]fluoroethylazide. J Med Chem51:8057-67 (2008) 
 
Caspase-3
Name:Caspase-3
Type:Hydrolase; heterotetramer of two heterodimers
Mol. Mass.:31607.55
Organism:Homo sapiens (Human)
Description:n/a
Residue:277
BDBM50273991
NameBDBM50273991
Synonyms:(S)-1-(4-Fluorobenzyl)-5-(2-(pyrimidin-4-yloxymethyl)-pyrrolidine-1-sulfonyl)isatin | CHEMBL515506
TypeSmall organic molecule
Emp. Form.C24H21FN4O5S
Mol. Mass.496.511
SMILESFc1ccc(CN2C(=O)C(=O)c3cc(ccc23)S(=O)(=O)N2CCC[C@H]2COc2ccncn2)cc1