Reaction Details
TargetCaspase-7
LigandBDBM50273989
Substrate/Competitorn/a
Meas. Tech.ChEMBL_537866 (CHEMBL990677)
EC50 16.8±n/a nM
Citation Smith, GGlaser, MPerumal, MNguyen, QDShan, BArstad, EAboagye, EO Design, synthesis, and biological characterization of a caspase 3/7 selective isatin labeled with 2-[18F]fluoroethylazide. J Med Chem51:8057-67 (2008) 
 
Caspase-7
Name:Caspase-7
Type:Enzyme
Mol. Mass.:34273.91
Organism:Homo sapiens (Human)
Description:P55210
Residue:303
BDBM50273989
NameBDBM50273989
Synonyms:(S)-1-(4-Fluorobenzyl)-5-(2-(3,5-difluorophenoxymethyl)-pyrrolidine-1-sulfonyl)isatin | CHEMBL456592
TypeSmall organic molecule
Emp. Form.C26H21F3N2O5S
Mol. Mass.530.516
SMILESFc1ccc(CN2C(=O)C(=O)c3cc(ccc23)S(=O)(=O)N2CCC[C@H]2COc2cc(F)cc(F)c2)cc1