Reaction Details
TargetCaspase-6
LigandBDBM10323
Substrate/Competitorn/a
Meas. Tech.ChEMBL_537868 (CHEMBL990680)
EC50>5000±n/a nM
Citation Smith, GGlaser, MPerumal, MNguyen, QDShan, BArstad, EAboagye, EO Design, synthesis, and biological characterization of a caspase 3/7 selective isatin labeled with 2-[18F]fluoroethylazide. J Med Chem51:8057-67 (2008) 
 
Caspase-6
Name:Caspase-6
Type:Enzyme
Mol. Mass.:33312.62
Organism:Homo sapiens (Human)
Description:P55212
Residue:293
BDBM10323
NameBDBM10323
Synonyms:(S)-1-Benzyl-5-{1-[2-(phenoxymethyl)pyrrolidinyl]sulfonyl}isatin CHEMBL439753 Isatin Sulfonamide 34 Pyrrolidine Isatin Analogue 2
TypeSmall organic molecule
Emp. Form.C26H24N2O5S
Mol. Mass.476.544
SMILESO=C1N(Cc2ccccc2)c2ccc(cc2C1=O)S(=O)(=O)N1CCC[C@H]1COc1ccccc1