Reaction Details
TargetCaspase-1
LigandBDBM50273337
Substrate/Competitorn/a
Meas. Tech.ChEMBL_537867 (CHEMBL990679)
EC50>5000±n/a nM
Citation Smith, GGlaser, MPerumal, MNguyen, QDShan, BArstad, EAboagye, EO Design, synthesis, and biological characterization of a caspase 3/7 selective isatin labeled with 2-[18F]fluoroethylazide. J Med Chem51:8057-67 (2008) 
 
Caspase-1
Name:Caspase-1
Type:Enzyme
Mol. Mass.:45154.13
Organism:Homo sapiens (Human)
Description:P29466
Residue:404
BDBM50273337
NameBDBM50273337
Synonyms:(S)-1-((1-(2-Fluoroethyl)-1H-[1,2,3]-triazol-4-yl)methyl)-5-(2-phenoxymethyl-pyrrolidine-1-sulfonyl)isatin | CHEMBL456798
TypeSmall organic molecule
Emp. Form.C24H24FN5O5S
Mol. Mass.513.541
SMILESFCCn1cc(CN2C(=O)C(=O)c3cc(ccc23)S(=O)(=O)N2CCC[C@H]2COc2ccccc2)nn1