Reaction Details
TargetCaspase-3
LigandBDBM50200305
Substrate/Competitorn/a
Meas. Tech.ChEMBL_537865 (CHEMBL990676)
EC50 25.3±n/a nM
Citation Smith, GGlaser, MPerumal, MNguyen, QDShan, BArstad, EAboagye, EO Design, synthesis, and biological characterization of a caspase 3/7 selective isatin labeled with 2-[18F]fluoroethylazide. J Med Chem51:8057-67 (2008) 
 
Caspase-3
Name:Caspase-3
Type:Hydrolase; heterotetramer of two heterodimers
Mol. Mass.:31607.55
Organism:Homo sapiens (Human)
Description:n/a
Residue:277
BDBM50200305
NameBDBM50200305
Synonyms:(S)-1-(4-iodobenzyl)-5-(2-phenoxymethyl-pyrrolidine-1-sulfonyl)isatin CHEMBL384023
TypeSmall organic molecule
Emp. Form.C26H23IN2O5S
Mol. Mass.602.441
SMILESIc1ccc(CN2C(=O)C(=O)c3cc(ccc23)S(=O)(=O)N2CCC[C@H]2COc2ccccc2)cc1