Reaction Details
TargetAcetylcholinesterase
LigandBDBM50273578
Substrate/Competitorn/a
Meas. Tech.ChEMBL_560895 (CHEMBL1013530)
IC50 9.1±n/a nM
Citation Fang, LAppenroth, DDecker, MKiehntopf, MLupp, APeng, SFleck, CZhang, YLehmann, J NO-donating tacrine hybrid compounds improve scopolamine-induced cognition impairment and show less hepatotoxicity. J Med Chem51:7666-9 (2008) 
 
Acetylcholinesterase
Name:Acetylcholinesterase
Type:Enzyme
Mol. Mass.:71812.79
Organism:Electrophorus electricus (Electric eel)
Description:n/a
Residue:633
BDBM50273578
NameBDBM50273578
Synonyms:9-[Nbeta-(2'-(Nitrooxy)ethyl)-beta-aminoethylamino]-1,2,3,4-tetrahydroacridine | CHEMBL512550
TypeSmall organic molecule
Emp. Form.C17H22N4O3
Mol. Mass.330.3816
SMILES[O-][N+](=O)OCCNCCNc1c2CCCCc2nc2ccccc12